BDBM4097 9-benzoyl-9H-carbazole-1,2,6,7-tetrol::Carbazole deriv. 9g
SMILES Oc1cc2n(C(=O)c3ccccc3)c3c(O)c(O)ccc3c2cc1O
InChI Key InChIKey=UHAYRLFHKPULPX-UHFFFAOYSA-N
Data  2 IC50
  Tab Delimited (TSV)   2D SDfile   Computed 3D by Vconf -m prep SDfile
Find this compound or compounds like it in BindingDB:
Activity Spreadsheet -- Enzyme Inhibition Constant Data from BindingDB
Found 2 hits for monomerid = 4097
LigandPNGBDBM4097(9-benzoyl-9H-carbazole-1,2,6,7-tetrol | Carbazole ...)
Affinity DataIC50:  2.40E+5nM. Assay description: IC50 is the inhibitor concentration, which inhibits 50% of PKA activity that catalyzes the transfer of the terminal phosphate from [gamma-32P] label...
In DepthDetails ArticlePubMed
TargetProto-oncogene tyrosine-protein kinase Src(Homo sapiens (Human))
Pfizer
LigandPNGBDBM4097(9-benzoyl-9H-carbazole-1,2,6,7-tetrol | Carbazole ...)
Affinity DataIC50:  900nM. Assay description: IC50 is the inhibitor concentration, which inhibits 50% of pp60c-src activity that catalyzes the transfer of the terminal phosphate from [gamma-32P] ...
In DepthDetails ArticlePubMed