BDBM411199 Methyl 2-(N-(4-(2-fluoro-6-methoxyphenyl)pyridin-3-yl)-2,6-bis(trifluoromethyl) isonicotinamido)acetate::US10385022, Example 195
SMILES COC(=O)CN(C(=O)c1cc(nc(c1)C(F)(F)F)C(F)(F)F)c1cnccc1-c1c(F)cccc1OC
InChI Key InChIKey=UPMYDEDBBSTRKL-UHFFFAOYSA-N
Data  1 EC50
  Tab Delimited (TSV)   2D SDfile   Computed 3D by Vconf -m prep SDfile
Find this compound or compounds like it in BindingDB:
Activity Spreadsheet -- Enzyme Inhibition Constant Data from BindingDB
Found 1 hit for monomerid = 411199
TargetG-protein coupled bile acid receptor 1(Homo sapiens (Human))
Hoffmann-La Roche
US Patent
LigandPNGBDBM411199(Methyl 2-(N-(4-(2-fluoro-6-methoxyphenyl)pyridin-3...)
Affinity DataEC50:  13nM. Assay description: CHO-dhfr(minus) cells expressing human GPBAR1 receptors are seeded 17-24 hours prior to the experiment 50.000 cells per well in a black 96 well plate...
Ligand InfoPC cidPC sid
In DepthDetails US Patent