BDBM412129 US10392402, Compound ID 9::US10807966, Compound 9
SMILES COc1cccc(CN(CCO)C(=O)Nc2cc([nH]n2)-c2ccncc2)c1
InChI Key InChIKey=JMKFXBGMVLTISS-UHFFFAOYSA-N
Data  4 IC50
  Tab Delimited (TSV)   2D SDfile   Computed 3D by Vconf -m prep SDfile
Find this compound or compounds like it in BindingDB:
Activity Spreadsheet -- Enzyme Inhibition Constant Data from BindingDB
Found 4 hits for monomerid = 412129
TargetRho-associated protein kinase 1(Homo sapiens (Human))
Translational Drug Development
US Patent
LigandPNGBDBM412129(US10392402, Compound ID 9 | US10807966, Compound 9)
Affinity DataIC50:  237nM. Assay description: The following assay protocol is for measuring the phosphorylation of a peptide substrate (FAM-KKLRRTLSVA-OH wherein FAM is carboxyfluorescein). The p...
Ligand Info
In DepthDetails US Patent
TargetRho-associated protein kinase 2(Homo sapiens (Human))
Translational Drug Development
US Patent
LigandPNGBDBM412129(US10392402, Compound ID 9 | US10807966, Compound 9)
Affinity DataIC50:  39.1nM
Ligand Info
In DepthDetails US Patent
TargetRho-associated protein kinase 1(Homo sapiens (Human))
Translational Drug Development
US Patent
LigandPNGBDBM412129(US10392402, Compound ID 9 | US10807966, Compound 9)
Affinity DataIC50:  237nM. Assay description: The following assay protocol is for measuring the phosphorylation of a peptide substrate (FAM-KKLRRTLSVA-OH wherein FAM is carboxyfluorescein). The p...
Ligand Info
In DepthDetails US Patent
TargetRho-associated protein kinase 2(Homo sapiens (Human))
Translational Drug Development
US Patent
LigandPNGBDBM412129(US10392402, Compound ID 9 | US10807966, Compound 9)
Affinity DataIC50:  39.1nM. Assay description: The following assay protocol is for measuring the phosphorylation of a peptide substrate (FAM-KKLRRTLSVA-OH wherein FAM is carboxyfluorescein). The p...
Ligand Info
In DepthDetails US Patent