BDBM412189 US10398703, Compound 9::US10966987, Compound 9
SMILES COc1cc2c(Oc3ccc(NC(=O)Nc4cc(C)on4)c(Cl)c3)ncnc2cc1OCCCN1CCC2(COC2)CC1
InChI Key InChIKey=BJFPOJZPJFHZRF-UHFFFAOYSA-N
Data  2 Kd
  Tab Delimited (TSV)   2D SDfile   Computed 3D by Vconf -m prep SDfile
Find this compound or compounds like it in BindingDB:
Activity Spreadsheet -- Enzyme Inhibition Constant Data from BindingDB
Found 2 hits for monomerid = 412189
TargetVascular endothelial growth factor receptor 2(Homo sapiens (Human))
Kala Pharmaceuticals
US Patent
LigandPNGBDBM412189(US10398703, Compound 9 | US10966987, Compound 9)
Affinity DataKd:  490nM. Assay description: A VEGFR2 tagged T7 phage strain was prepared in an Escherichia coli (E. coli) derived from the BL21 strain. The E. coli were grown to log-phase, infe...
Ligand Info
In DepthDetails US Patent
TargetVascular endothelial growth factor receptor 2(Homo sapiens (Human))
Kala Pharmaceuticals
US Patent
LigandPNGBDBM412189(US10398703, Compound 9 | US10966987, Compound 9)
Affinity DataKd:  490nM. Assay description: A competition binding assay (DISCOVERX KINOMESCAN™) was used to measure the ability of a compound to compete for binding of an immobilized adenosine ...
Ligand Info
In DepthDetails US Patent