BDBM420336 US10479784, Compound I-9::US10961232, Compound I-9
SMILES Nc1ncc(nc1C(=O)Nc1ccccc1)-c1cccc(F)c1
InChI Key InChIKey=SDIYRNRTJWDZTC-UHFFFAOYSA-N
Data  2 KI
  Tab Delimited (TSV)   2D SDfile   Computed 3D by Vconf -m prep SDfile
Find this compound or compounds like it in BindingDB:
Activity Spreadsheet -- Enzyme Inhibition Constant Data from BindingDB
Found 2 hits for monomerid = 420336
TargetSerine/threonine-protein kinase ATR(Homo sapiens (Human))
Vertex Pharmaceuticals
US Patent
LigandPNGBDBM420336(US10479784, Compound I-9 | US10961232, Compound I-...)
Affinity DataKi:  2.55E+3nM. Assay description: Compounds were screened for their ability to inhibit ATR kinase using a radioactive-phosphate incorporation assay. Assays were carried out in a mixtu...
Ligand Info
In DepthDetails US Patent
TargetSerine/threonine-protein kinase ATR(Homo sapiens (Human))
Vertex Pharmaceuticals
US Patent
LigandPNGBDBM420336(US10479784, Compound I-9 | US10961232, Compound I-...)
Affinity DataKi:  5.05E+3nM. Assay description: Compounds were screened for their ability to inhibit ATR kinase using a radioactive-phosphate incorporation assay. Assays were carried out in a mixtu...
Ligand Info
In DepthDetails US Patent