BDBM422827 US10508109, Example 18::tert-butyl (2-((2-(5-bromo-2,4- dimethoxyphenyl)imidazo[1,2- a]pyrimidin-7- yl)amino)ethyl)carbamate
SMILES COc1cc(CO)c(cc1Br)-c1cn2ccc(NCCNC(=O)OC(C)(C)C)nc2n1
InChI Key InChIKey=HOMHBPATPBIDSJ-UHFFFAOYSA-N
Data  1 IC50
  Tab Delimited (TSV)   2D SDfile   Computed 3D by Vconf -m prep SDfile
Find this compound or compounds like it in BindingDB:
Activity Spreadsheet -- Enzyme Inhibition Constant Data from BindingDB
Found 1 hit for monomerid = 422827
TargetHistone-lysine N-methyltransferase SUV39H2(Homo sapiens (Human))
Oncotherapy Science
US Patent
LigandPNGBDBM422827(US10508109, Example 18 | tert-butyl (2-((2-(5-brom...)
Affinity DataIC50:  88.4nM. Assay description: Assay buffer (4 μL) was added into all the wells, including test compound and control wells (except for Sinefungin control wells), using the Mul...
Ligand InfoPC cidPC sid
In DepthDetails US Patent