BDBM422845 US10508109, Example 36::tert-butyl (1-(2-(5-chloro-2,4- dimethoxyphenyl)imidazo[1,2- a]pyrimidin-7-yl)piperidin-4- yl)carbamate
SMILES COc1cc(CO)c(cc1Cl)-c1cn2ccc(nc2n1)N1CCC(CC1)NC(=O)OC(C)(C)C
InChI Key InChIKey=FEUWVONTIJPJPG-UHFFFAOYSA-N
Data  1 IC50
  Tab Delimited (TSV)   2D SDfile   Computed 3D by Vconf -m prep SDfile
Find this compound or compounds like it in BindingDB:
Activity Spreadsheet -- Enzyme Inhibition Constant Data from BindingDB
Found 1 hit for monomerid = 422845
TargetHistone-lysine N-methyltransferase SUV39H2(Homo sapiens (Human))
Oncotherapy Science
US Patent
LigandPNGBDBM422845(US10508109, Example 36 | tert-butyl (1-(2-(5-chlor...)
Affinity DataIC50:  55.2nM. Assay description: Assay buffer (4 μL) was added into all the wells, including test compound and control wells (except for Sinefungin control wells), using the Mul...
Ligand InfoPC cidPC sid
In DepthDetails US Patent