BDBM42383 4-methyl-2-(4,5,6,7-tetrahydrobenzothiophene-3-carbonylamino)thiazole-5-carboxylic acid methyl ester::4-methyl-2-[[oxo(4,5,6,7-tetrahydro-1-benzothiophen-3-yl)methyl]amino]-5-thiazolecarboxylic acid methyl ester::MLS000065667::SMR000080317::cid_1245230::methyl 4-methyl-2-(4,5,6,7-tetrahydro-1-benzothiophen-3-ylcarbonylamino)-1,3-thiazole-5-carboxylate::methyl 4-methyl-2-(4,5,6,7-tetrahydro-1-benzothiophene-3-carbonylamino)-1,3-thiazole-5-carboxylate::methyl 4-methyl-2-[(4,5,6,7-tetrahydro-1-benzothien-3-ylcarbonyl)amino]-1,3-thiazole-5-carboxylate
SMILES COC(=O)c1sc(NC(=O)c2csc3CCCCc23)nc1C
InChI Key InChIKey=OILVDCAEQZNVRB-UHFFFAOYSA-N
Data  1 EC50
  Tab Delimited (TSV)   2D SDfile   Computed 3D by Vconf -m prep SDfile
Find this compound or compounds like it in BindingDB:
Activity Spreadsheet -- Enzyme Inhibition Constant Data from BindingDB
Found 1 hit for monomerid = 42383
TargetLysosomal acid glucosylceramidase(Homo sapiens (Human))
The Scripps Research Institute Molecular Screening Center
Curated by PubChem BioAssay
LigandPNGBDBM42383(4-methyl-2-(4,5,6,7-tetrahydrobenzothiophene-3-car...)
Affinity DataEC50: >5.00E+4nM. Assay description: Source (MLSCN Center Name): The Scripps Research Institute Molecular Screening Center Center Affiliation: The Scripps Research Institute, TSRI Assay ...
In DepthDetails PCBioAssay