BDBM42408 3-[[[1-(2-furanylmethyl)-5-tetrazolyl]methyl-[(2-methoxyphenyl)methyl]amino]methyl]-6-methyl-1H-quinolin-2-one::3-[[[1-(2-furfuryl)tetrazol-5-yl]methyl-o-anisyl-amino]methyl]-6-methyl-carbostyril::3-[[[1-(furan-2-ylmethyl)-1,2,3,4-tetrazol-5-yl]methyl-[(2-methoxyphenyl)methyl]amino]methyl]-6-methyl-1H-quinolin-2-one::3-[[[1-(furan-2-ylmethyl)tetrazol-5-yl]methyl-[(2-methoxyphenyl)methyl]amino]methyl]-6-methyl-1H-quinolin-2-one::3-{[(1-Furan-2-ylmethyl-1H-tetrazol-5-ylmethyl)-(2-methoxy-benzyl)-amino]-methyl}-6-methyl-1H-quinolin-2-one::MLS000032393::SMR000004412::cid_647823
SMILES COc1ccccc1CN(Cc1nnnn1Cc1ccco1)Cc1cc2cc(C)ccc2[nH]c1=O
InChI Key InChIKey=BMDSAZDIDMDPRU-UHFFFAOYSA-N
Data  2 IC50
  Tab Delimited (TSV)   2D SDfile   Computed 3D by Vconf -m prep SDfile
Find this compound or compounds like it in BindingDB:
Activity Spreadsheet -- Enzyme Inhibition Constant Data from BindingDB
Found 2 hits for monomerid = 42408
TargetNeuropeptide Y receptor type 2(Homo sapiens (Human))
The Scripps Research Institute Molecular Screening Center
Curated by PubChem BioAssay
LigandPNGBDBM42408(3-[[[1-(2-furanylmethyl)-5-tetrazolyl]methyl-[(2-m...)
Affinity DataIC50: >3.50E+4nM. Assay description: Source (MLSCN Center Name): The Scripps Research Institute Molecular Screening Center Affiliation: The Scripps Research Institute, TSRI Assay Provide...
In DepthDetails PCBioAssay
TargetNeuropeptide Y receptor type 1(Homo sapiens (Human))
The Scripps Research Institute Molecular Screening Center
Curated by PubChem BioAssay
LigandPNGBDBM42408(3-[[[1-(2-furanylmethyl)-5-tetrazolyl]methyl-[(2-m...)
Affinity DataIC50:  2.27E+4nM. Assay description: Source (MLSCN Center Name): The Scripps Research Institute Molecular Screening Center Affiliation: The Scripps Research Institute, TSRI Assay Provide...
In DepthDetails PCBioAssay