BDBM42422 MLS000519733::N-cyclopentyl-2-[2-furanylmethyl-(1-oxo-2-thiophen-2-ylethyl)amino]-2-methylbutanamide::N-cyclopentyl-2-[2-furfuryl-[2-(2-thienyl)acetyl]amino]-2-methyl-butyramide::N-cyclopentyl-2-[furan-2-ylmethyl(2-thiophen-2-ylethanoyl)amino]-2-methyl-butanamide::N-cyclopentyl-2-[furan-2-ylmethyl-(2-thiophen-2-ylacetyl)amino]-2-methylbutanamide::SMR000130151::cid_3249852
SMILES CCC(C)(N(Cc1ccco1)C(=O)Cc1cccs1)C(=O)NC1CCCC1
InChI Key InChIKey=HLOBYLGUYYVXFV-UHFFFAOYSA-N
Data  2 IC50
  Tab Delimited (TSV)   2D SDfile   Computed 3D by Vconf -m prep SDfile
Find this compound or compounds like it in BindingDB:
Activity Spreadsheet -- Enzyme Inhibition Constant Data from BindingDB
Found 2 hits for monomerid = 42422
TargetNeuropeptide Y receptor type 2(Homo sapiens (Human))
The Scripps Research Institute Molecular Screening Center
Curated by PubChem BioAssay
LigandPNGBDBM42422(MLS000519733 | N-cyclopentyl-2-[2-furanylmethyl-(1...)
Affinity DataIC50: >3.50E+4nM. Assay description: Source (MLSCN Center Name): The Scripps Research Institute Molecular Screening Center Affiliation: The Scripps Research Institute, TSRI Assay Provide...
In DepthDetails PCBioAssay
TargetNeuropeptide Y receptor type 1(Homo sapiens (Human))
The Scripps Research Institute Molecular Screening Center
Curated by PubChem BioAssay
LigandPNGBDBM42422(MLS000519733 | N-cyclopentyl-2-[2-furanylmethyl-(1...)
Affinity DataIC50: >3.50E+4nM. Assay description: Source (MLSCN Center Name): The Scripps Research Institute Molecular Screening Center Affiliation: The Scripps Research Institute, TSRI Assay Provide...
In DepthDetails PCBioAssay