BDBM424498 US10508120, Compound I-953::US10577373, Compound I-953::US11046698, Compound I-953
SMILES CNc1cc(nc2c(cnn12)C(=O)N[C@@H]1CC[C@H]1OC)-c1cn(CCN2CCN(C)CC2)c2ncccc12
InChI Key InChIKey=GCRNXRUWVMXWGS-FYYLOGMGSA-N
Data  3 Kd
  Tab Delimited (TSV)   2D SDfile   Computed 3D by Vconf -m prep SDfile
Find this compound or compounds like it in BindingDB:
Activity Spreadsheet -- Enzyme Inhibition Constant Data from BindingDB
Found 3 hits for monomerid = 424498
TargetNon-receptor tyrosine-protein kinase TYK2 [556-888](Homo sapiens (Human))
Nimbus Lakshimi
US Patent
LigandPNGBDBM424498(US10508120, Compound I-953 | US10577373, Compound ...)
Affinity DataKd:  0.600nM. Assay description: Binding constants for compounds of the present invention against the JH2 domain were determined by the following protocol for a KINOMEscan® assay (Di...
Ligand InfoPC cidPC sid
In DepthDetails US Patent
TargetNon-receptor tyrosine-protein kinase TYK2 [556-888](Homo sapiens (Human))
Nimbus Lakshimi
US Patent
LigandPNGBDBM424498(US10508120, Compound I-953 | US10577373, Compound ...)
Affinity DataKd:  0.600nM. Assay description: Binding constants for compounds of the present invention against the JH2 domain were determined by the following protocol for a KINOMEscan® assay (Di...
Ligand InfoPC cidPC sid
In DepthDetails US Patent
TargetNon-receptor tyrosine-protein kinase TYK2 [556-888](Homo sapiens (Human))
Nimbus Lakshimi
US Patent
LigandPNGBDBM424498(US10508120, Compound I-953 | US10577373, Compound ...)
Affinity DataKd:  0.600nM. Assay description: Binding constants for compounds of the present invention against the JH2 domain were determined by the following protocol for a KINOMEscan® assay (Di...
Ligand InfoPC cidPC sid
In DepthDetails US Patent