BDBM425896 US10512644, Compound alpha-6-mPEG2-O-Morphine
SMILES COCCOCCO[C@H]1C=CC2C3Cc4ccc(O)c5O[C@@H]1[C@]2(CCN3C)c45
InChI Key InChIKey=JUPMXSDBQVBJEA-FTUAYMQQSA-N
Data  3 KI  2 EC50
  Tab Delimited (TSV)   2D SDfile   Computed 3D by Vconf -m prep SDfile
Find this compound or compounds like it in BindingDB:
Activity Spreadsheet -- Enzyme Inhibition Constant Data from BindingDB
Found 5 hits for monomerid = 425896
TargetMu-type opioid receptor(Homo sapiens (Human))
Inheris Pharmaceuticals
US Patent
LigandPNGBDBM425896(US10512644, Compound alpha-6-mPEG2-O-Morphine)
Affinity DataKi:  22nM. Assay description: Briefly, serial dilutions of the test compounds were placed in a 96-well plate to which were added SPA beads, membrane and radioligand. The assay con...
Ligand InfoPC cidPC sid
In DepthDetails US Patent
TargetKappa-type opioid receptor(Homo sapiens (Human))
Inheris Pharmaceuticals
US Patent
LigandPNGBDBM425896(US10512644, Compound alpha-6-mPEG2-O-Morphine)
Affinity DataKi:  404nM. Assay description: Briefly, serial dilutions of the test compounds were placed in a 96-well plate to which were added SPA beads, membrane and radioligand. The assay con...
Ligand InfoPC cidPC sid
In DepthDetails US Patent
TargetDelta-type opioid receptor(Homo sapiens (Human))
Inheris Pharmaceuticals
US Patent
LigandPNGBDBM425896(US10512644, Compound alpha-6-mPEG2-O-Morphine)
Affinity DataKi:  2.60E+3nM. Assay description: Briefly, serial dilutions of the test compounds were placed in a 96-well plate to which were added SPA beads, membrane and radioligand. The assay con...
Ligand InfoPC cidPC sid
In DepthDetails US Patent
TargetMu-type opioid receptor(Homo sapiens (Human))
Inheris Pharmaceuticals
US Patent
LigandPNGBDBM425896(US10512644, Compound alpha-6-mPEG2-O-Morphine)
Affinity DataEC50:  93.3nM. Assay description: Briefly, suspensions of cells expressing either the mu, kappa or delta opioid receptors were prepared in buffer containing 0.5 mM isobutyl-methyl xan...
Ligand InfoPC cidPC sid
In DepthDetails US Patent
TargetKappa-type opioid receptor(Homo sapiens (Human))
Inheris Pharmaceuticals
US Patent
LigandPNGBDBM425896(US10512644, Compound alpha-6-mPEG2-O-Morphine)
Affinity DataEC50:  641nM. Assay description: Briefly, suspensions of cells expressing either the mu, kappa or delta opioid receptors were prepared in buffer containing 0.5 mM isobutyl-methyl xan...
Ligand InfoPC cidPC sid
In DepthDetails US Patent