BDBM426894 2-(Methylsulfanyl)ethyl 4-[2-(4-fluorophenyl)-4-oxo-1,3-thiazolidin-3-yl]-3-methylbenzoate::US10544113, No. 202
SMILES CC(=O)Nc1ccc(cc1)S(=O)(=O)NC(=O)c1ccc(N2C(SCC2=O)c2ccc(F)cc2)c(C)c1
InChI Key InChIKey=QATZWRKPFZHVSQ-UHFFFAOYSA-N
Data  1 EC50
  Tab Delimited (TSV)   2D SDfile   Computed 3D by Vconf -m prep SDfile
Find this compound or compounds like it in BindingDB:
Activity Spreadsheet -- Enzyme Inhibition Constant Data from BindingDB
Found 1 hit for monomerid = 426894
Target5-hydroxytryptamine receptor 7(Homo sapiens (Human))
National Health Research Institute
US Patent
LigandPNGBDBM426894(2-(Methylsulfanyl)ethyl 4-[2-(4-fluorophenyl)-4-ox...)
Affinity DataEC50:  600nM. Assay description: One day before the assay, CORNING black with clear flat bottom 96-well assay plates were coated with a 0.1 mg/mL Poly-L-Lysine solution. CHO-K1/MOR/G...
Ligand InfoPC cidPC sid
In DepthDetails US Patent