BDBM427009 2-(2-Methoxyethoxy)ethyl 4- ({4-[2-(4-fluorophenyl)-4- oxo-1,3-thiazolidin-3-yl]-3- methylbenzoyl}sulfamoyl) benzoate::US10544113, No. 591
SMILES COCCOCCOC(=O)c1ccc(cc1)S(=O)(=O)NC(=O)c1ccc(N2C(SCC2=O)c2ccc(F)cc2)c(C)c1
InChI Key InChIKey=ZTTSWVQPLKBVQE-UHFFFAOYSA-N
Data  1 EC50
  Tab Delimited (TSV)   2D SDfile   Computed 3D by Vconf -m prep SDfile
Find this compound or compounds like it in BindingDB:
Activity Spreadsheet -- Enzyme Inhibition Constant Data from BindingDB
Found 1 hit for monomerid = 427009
Target5-hydroxytryptamine receptor 7(Homo sapiens (Human))
National Health Research Institute
US Patent
LigandPNGBDBM427009(2-(2-Methoxyethoxy)ethyl 4- ({4-[2-(4-fluorophenyl...)
Affinity DataEC50:  1.03E+4nM. Assay description: One day before the assay, CORNING black with clear flat bottom 96-well assay plates were coated with a 0.1 mg/mL Poly-L-Lysine solution. CHO-K1/MOR/G...
Ligand InfoPC cidPC sid
In DepthDetails US Patent