BDBM42747 2-ethoxy-N-[3-[[3-(2-hydroxyethylsulfonyl)anilino]-oxomethyl]phenyl]-3-pyridinecarboxamide::2-ethoxy-N-[3-[[3-(2-hydroxyethylsulfonyl)phenyl]carbamoyl]phenyl]nicotinamide::2-ethoxy-N-[3-[[3-(2-hydroxyethylsulfonyl)phenyl]carbamoyl]phenyl]pyridine-3-carboxamide::2-ethoxy-N-{3-[({3-[(2-hydroxyethyl)sulfonyl]phenyl}amino)carbonyl]phenyl}nicotinamide::MLS000094592::SMR000030145::cid_3243903
SMILES CCOc1ncccc1C(=O)Nc1cccc(c1)C(=O)Nc1cccc(c1)S(=O)(=O)CCO
InChI Key InChIKey=KPGOUKKEQDUDBY-UHFFFAOYSA-N
Data  1 IC50
  Tab Delimited (TSV)   2D SDfile   Computed 3D by Vconf -m prep SDfile
Find this compound or compounds like it in BindingDB:
Activity Spreadsheet -- Enzyme Inhibition Constant Data from BindingDB
Found 1 hit for monomerid = 42747
TargetMitogen-activated protein kinase 10(Homo sapiens (Human))
The Scripps Research Institute Molecular Screening Center
Curated by PubChem BioAssay
LigandPNGBDBM42747(2-ethoxy-N-[3-[[3-(2-hydroxyethylsulfonyl)anilino]...)
Affinity DataIC50:  5.59E+3nM. Assay description: Source (MLSCN Center Name): The Scripps Research Institute Molecular Screening Center Affiliation: The Scripps Research Institute, TSRI Assay Provide...
In DepthDetails PCBioAssay