BDBM42807 4-[(4-ketoquinazolin-3-yl)methyl]benzoic acid ethyl ester::4-[(4-oxo-3-quinazolinyl)methyl]benzoic acid ethyl ester::MLS000064146::SMR000076057::cid_977664::ethyl 4-[(4-oxidanylidenequinazolin-3-yl)methyl]benzoate::ethyl 4-[(4-oxo-3(4H)-quinazolinyl)methyl]benzoate::ethyl 4-[(4-oxoquinazolin-3-yl)methyl]benzoate
SMILES CCOC(=O)c1ccc(Cn2cnc3ccccc3c2=O)cc1
InChI Key InChIKey=AZUWASSGAPBLGR-UHFFFAOYSA-N
Data  1 IC50
  Tab Delimited (TSV)   2D SDfile   Computed 3D by Vconf -m prep SDfile
Find this compound or compounds like it in BindingDB:
Activity Spreadsheet -- Enzyme Inhibition Constant Data from BindingDB
Found 1 hit for monomerid = 42807
TargetMitogen-activated protein kinase 10(Homo sapiens (Human))
The Scripps Research Institute Molecular Screening Center
Curated by PubChem BioAssay
LigandPNGBDBM42807(4-[(4-ketoquinazolin-3-yl)methyl]benzoic acid ethy...)
Affinity DataIC50:  1.23E+4nM. Assay description: Source (MLSCN Center Name): The Scripps Research Institute Molecular Screening Center Affiliation: The Scripps Research Institute, TSRI Assay Provide...
In DepthDetails PCBioAssay