BDBM42827 2-(veratrylcarbamoylamino)benzoic acid methyl ester::2-[[[(3,4-dimethoxyphenyl)methylamino]-oxomethyl]amino]benzoic acid methyl ester::MLS000064005::SMR000076985::cid_971348::methyl 2-({[(3,4-dimethoxybenzyl)amino]carbonyl}amino)benzoate::methyl 2-[(3,4-dimethoxyphenyl)methylcarbamoylamino]benzoate
SMILES COC(=O)c1ccccc1NC(=O)NCc1ccc(OC)c(OC)c1
InChI Key InChIKey=MMBFWEASPKRKSZ-UHFFFAOYSA-N
Data  1 IC50
  Tab Delimited (TSV)   2D SDfile   Computed 3D by Vconf -m prep SDfile
Find this compound or compounds like it in BindingDB:
Activity Spreadsheet -- Enzyme Inhibition Constant Data from BindingDB
Found 1 hit for monomerid = 42827
TargetMitogen-activated protein kinase 10(Homo sapiens (Human))
The Scripps Research Institute Molecular Screening Center
Curated by PubChem BioAssay
LigandPNGBDBM42827(2-(veratrylcarbamoylamino)benzoic acid methyl este...)
Affinity DataIC50: >3.10E+4nM. Assay description: Source (MLSCN Center Name): The Scripps Research Institute Molecular Screening Center Affiliation: The Scripps Research Institute, TSRI Assay Provide...
In DepthDetails PCBioAssay