BDBM44102 5-[(2-chloranyl-4-fluoranyl-phenoxy)methyl]-N-methyl-N-[(5-methylfuran-2-yl)methyl]-1,2-oxazole-3-carboxamide::5-[(2-chloro-4-fluoro-phenoxy)methyl]-N-methyl-N-[(5-methyl-2-furyl)methyl]isoxazole-3-carboxamide::5-[(2-chloro-4-fluorophenoxy)methyl]-N-methyl-N-[(5-methyl-2-furanyl)methyl]-3-isoxazolecarboxamide::5-[(2-chloro-4-fluorophenoxy)methyl]-N-methyl-N-[(5-methyl-2-furyl)methyl]isoxazole-3-carboxamide::5-[(2-chloro-4-fluorophenoxy)methyl]-N-methyl-N-[(5-methylfuran-2-yl)methyl]-1,2-oxazole-3-carboxamide::MLS000734222::SMR000318373::cid_16191720
SMILES CN(Cc1ccc(C)o1)C(=O)c1cc(COc2ccc(F)cc2Cl)on1
InChI Key InChIKey=BWZIZNPFAOXEEK-UHFFFAOYSA-N
Data  1 EC50
  Tab Delimited (TSV)   2D SDfile   Computed 3D by Vconf -m prep SDfile
Find this compound or compounds like it in BindingDB:
Activity Spreadsheet -- Enzyme Inhibition Constant Data from BindingDB
Found 1 hit for monomerid = 44102
TargetSolute carrier family 12 member 5(Homo sapiens (Human))
Vanderbilt Screening Center For Gpcrs, Ion Channels And Transporters
Curated by PubChem BioAssay
LigandPNGBDBM44102(5-[(2-chloranyl-4-fluoranyl-phenoxy)methyl]-N-meth...)
Affinity DataEC50:  8.92E+4nM. Assay description: Vanderbilt Screening Center for GPCRs, Ion Channels and Transporters Assay Provider: Eric Delpire Assay Provider Affliation: Vanderbilt University Gr...
In DepthDetails PCBioAssay