BDBM442066 US10647713, Compound I-9::US11396508, Compound I-9
SMILES COc1c(Nc2cc(NC(=O)C3CC3)nc3[nH]c(nc23)C2CC2)cccc1-c1ncn(C)n1
InChI Key InChIKey=OACJHQSURCAFDD-UHFFFAOYSA-N
Data  2 Kd
  Tab Delimited (TSV)   2D SDfile   Computed 3D by Vconf -m prep SDfile
Find this compound or compounds like it in BindingDB:
Activity Spreadsheet -- Enzyme Inhibition Constant Data from BindingDB
Found 2 hits for monomerid = 442066
TargetNon-receptor tyrosine-protein kinase TYK2 [556-888](Homo sapiens (Human))
Nimbus Lakshmi
US Patent
LigandPNGBDBM442066(US10647713, Compound I-9 | US11396508, Compound I-...)
Affinity DataKd: >10nM. Assay description: The binding reaction was assembled by combining 16 μl of DNA-tagged kinase extract, 3.8 μl liganded affinity beads, and 0.18 μl test c...
Ligand InfoPC cidPC sid
In DepthDetails US Patent
TargetNon-receptor tyrosine-protein kinase TYK2 [556-888](Homo sapiens (Human))
Nimbus Lakshmi
US Patent
LigandPNGBDBM442066(US10647713, Compound I-9 | US11396508, Compound I-...)
Affinity DataKd: >10nM. Assay description: Binding constants for compounds of the present invention against the JH2 domain were determined by the following protocol for a KINOMEscan® assay (Di...
Ligand InfoPC cidPC sid
In DepthDetails US Patent