BDBM44569 3-[5-(4-Chloro-phenoxymethyl)-[1,3,4]oxadiazol-2-ylsulfanylmethyl]-4-methoxy-benzoic acid methyl ester::3-[[[5-[(4-chlorophenoxy)methyl]-1,3,4-oxadiazol-2-yl]thio]methyl]-4-methoxy-benzoic acid methyl ester::3-[[[5-[(4-chlorophenoxy)methyl]-1,3,4-oxadiazol-2-yl]thio]methyl]-4-methoxybenzoic acid methyl ester::MLS000072938::SMR000002201::cid_650867::methyl 3-[[5-[(4-chloranylphenoxy)methyl]-1,3,4-oxadiazol-2-yl]sulfanylmethyl]-4-methoxy-benzoate::methyl 3-[[5-[(4-chlorophenoxy)methyl]-1,3,4-oxadiazol-2-yl]sulfanylmethyl]-4-methoxybenzoate
SMILES COC(=O)c1ccc(OC)c(CSc2nnc(COc3ccc(Cl)cc3)o2)c1
InChI Key InChIKey=GVEWMOPYFJDXKJ-UHFFFAOYSA-N
Data  1 EC50
  Tab Delimited (TSV)   2D SDfile   Computed 3D by Vconf -m prep SDfile
Find this compound or compounds like it in BindingDB:
Activity Spreadsheet -- Enzyme Inhibition Constant Data from BindingDB
Found 1 hit for monomerid = 44569
TargetMultidrug resistance-associated protein 1(Homo sapiens (Human))
Srmlsc
Curated by PubChem BioAssay
LigandPNGBDBM44569(3-[5-(4-Chloro-phenoxymethyl)-[1,3,4]oxadiazol-2-y...)
Affinity DataEC50:  7.77E+3nM. Assay description: Southern Research Molecular Libraries Screening Center (SRMLSC) Southern Research Institute (Birmingham, Alabama) NIH Molecular Libraries Screening C...
In DepthDetails PCBioAssay