BDBM44576 1-(2-bromanyl-4-chloranyl-phenyl)sulfonylpiperidine::1-(2-bromo-4-chloro-phenyl)sulfonylpiperidine::1-(2-bromo-4-chlorophenyl)sulfonylpiperidine::1-[(2-bromo-4-chlorophenyl)sulfonyl]piperidine::DEXAMETHASONE 21-ACETATE::DEXAMETHASONE ACETATE::MLS000028544::MLS000060983::SMR000058327::SMR000069748::cid_236702::cid_772156
SMILES Clc1ccc(c(Br)c1)S(=O)(=O)N1CCCCC1
InChI Key InChIKey=WBOLWSACURXERW-UHFFFAOYSA-N
Data  3 EC50
  Tab Delimited (TSV)   2D SDfile   Computed 3D by Vconf -m prep SDfile
Find this compound or compounds like it in BindingDB:
Activity Spreadsheet -- Enzyme Inhibition Constant Data from BindingDB
Found 3 hits for monomerid = 44576
TargetMultidrug resistance-associated protein 1(Homo sapiens (Human))
Srmlsc
Curated by PubChem BioAssay
LigandPNGBDBM44576(1-(2-bromanyl-4-chloranyl-phenyl)sulfonylpiperidin...)
Affinity DataEC50:  5.42E+3nM. Assay description: Southern Research Molecular Libraries Screening Center (SRMLSC) Southern Research Institute (Birmingham, Alabama) NIH Molecular Libraries Screening C...
In DepthDetails PCBioAssay
TargetIon channel NompC(Danio rerio)
The Scripps Research Institute Molecular Screening Center
Curated by PubChem BioAssay
LigandPNGBDBM44576(1-(2-bromanyl-4-chloranyl-phenyl)sulfonylpiperidin...)
Affinity DataEC50:  2.99E+4nM. Assay description: Source (MLPCN Center Name): The Scripps Research Institute Molecular Screening Center (SRIMSC) Center Affiliation: The Scripps Research Institute (TS...
In DepthDetails PCBioAssay
TargetMucolipin-3(Homo sapiens (Human))
The Scripps Research Institute Molecular Screening Center
Curated by PubChem BioAssay
LigandPNGBDBM44576(1-(2-bromanyl-4-chloranyl-phenyl)sulfonylpiperidin...)
Affinity DataEC50: >2.99E+4nM. Assay description: Source (MLPCN Center Name): The Scripps Research Institute Molecular Screening Center (SRIMSC) Center Affiliation: The Scripps Research Institute (TS...
In DepthDetails PCBioAssay