BDBM44807 2-(2,3-dihydro-1,4-benzodioxin-3-carbonylamino)benzoic acid ethyl ester::2-[[2,3-dihydro-1,4-benzodioxin-3-yl(oxo)methyl]amino]benzoic acid ethyl ester::MLS000109694::SMR000105633::cid_2788375::ethyl 2-(2,3-dihydro-1,4-benzodioxin-3-ylcarbonylamino)benzoate::ethyl 2-(2,3-dihydro-1,4-benzodioxine-3-carbonylamino)benzoate
SMILES CCOC(=O)c1ccccc1NC(=O)C1COc2ccccc2O1
InChI Key InChIKey=YSXGTWQHCFHNGJ-UHFFFAOYSA-N
Data  1 EC50
  Tab Delimited (TSV)   2D SDfile   Computed 3D by Vconf -m prep SDfile
Find this compound or compounds like it in BindingDB:
Activity Spreadsheet -- Enzyme Inhibition Constant Data from BindingDB
Found 1 hit for monomerid = 44807
TargetMultidrug resistance-associated protein 1(Homo sapiens (Human))
Srmlsc
Curated by PubChem BioAssay
LigandPNGBDBM44807(2-(2,3-dihydro-1,4-benzodioxin-3-carbonylamino)ben...)
Affinity DataEC50:  2.28E+3nM. Assay description: Southern Research Molecular Libraries Screening Center (SRMLSC) Southern Research Institute (Birmingham, Alabama) NIH Molecular Libraries Screening C...
In DepthDetails PCBioAssay