BDBM448354 Perampanel, 9
SMILES CCCOc1cc(Cl)cc(c1)C1C=C(C(=O)N(C1=O)c1cncnc1)c1ccccc1C#N
InChI Key InChIKey=AOBBDYILZJKJEF-UHFFFAOYSA-N
Data  1 IC50
  Tab Delimited (TSV)   2D SDfile   Computed 3D by Vconf -m prep SDfile
Find this compound or compounds like it in BindingDB:
Activity Spreadsheet -- Enzyme Inhibition Constant Data from BindingDB
Found 1 hit for monomerid = 448354
TargetReplicase polyprotein 1ab(2019-nCoV)
Yale University
LigandPNGBDBM448354(Perampanel, 9)
Affinity DataIC50:  5.50E+3nM. Assay description: Inhibition of proteolytic activity was tested using recombinant SARS-CoV-2Mpro, which was expressed and purified as previously described.8,12 For the...
Ligand InfoPC cidPC sid
In DepthDetails Article