BDBM45224 4-[2-[(3,4-difluorophenyl)methylidene]hydrazinyl]benzoic acid;sulfuric acid::4-[2-[[3,4-bis(fluoranyl)phenyl]methylidene]hydrazinyl]benzoic acid;sulfuric acid::4-[N'-(3,4-difluorobenzylidene)hydrazino]benzoic acid;sulfuric acid::MLS000395056::SMR000248431::cid_15945147
SMILES OC(=O)c1ccc(cc1)N=NCc1ccc(F)c(F)c1
InChI Key InChIKey=ARHMZWNRRHIBER-UHFFFAOYSA-N
Data  2 EC50
  Tab Delimited (TSV)   2D SDfile   Computed 3D by Vconf -m prep SDfile
Find this compound or compounds like it in BindingDB:
Activity Spreadsheet -- Enzyme Inhibition Constant Data from BindingDB
Found 2 hits for monomerid = 45224
TargetTranscription factor p65(Homo sapiens (Human))
Srmlsc
Curated by PubChem BioAssay
LigandPNGBDBM45224(4-[2-[(3,4-difluorophenyl)methylidene]hydrazinyl]b...)
Affinity DataEC50:  650nM. Assay description: Southern Research Molecular Libraries Screening Center (SRMLSC) Southern Research Institute (Birmingham, Alabama) NIH Molecular Libraries Screening C...
Ligand InfoPC cidPC sid
In DepthDetails PCBioAssay
TargetMultidrug resistance-associated protein 1(Homo sapiens (Human))
Srmlsc
Curated by PubChem BioAssay
LigandPNGBDBM45224(4-[2-[(3,4-difluorophenyl)methylidene]hydrazinyl]b...)
Affinity DataEC50:  7.07E+3nM. Assay description: Southern Research Molecular Libraries Screening Center (SRMLSC) Southern Research Institute (Birmingham, Alabama) NIH Molecular Libraries Screening C...
Ligand InfoPC cidPC sid
In DepthDetails PCBioAssay