BDBM45382 4-[(4-keto-6-methyl-1H-pyrimidin-2-yl)amino]benzoic acid methyl ester::4-[(6-methyl-4-oxo-1H-pyrimidin-2-yl)amino]benzoic acid methyl ester::MLS000097322::SMR000075911::cid_2791783::methyl 4-[(4-methyl-6-oxo-1,6-dihydro-2-pyrimidinyl)amino]benzoate::methyl 4-[(6-methyl-4-oxidanylidene-1H-pyrimidin-2-yl)amino]benzoate::methyl 4-[(6-methyl-4-oxo-1H-pyrimidin-2-yl)amino]benzoate
SMILES COC(=O)c1ccc(Nc2nc(C)cc(=O)[nH]2)cc1
InChI Key InChIKey=UTNSVGAYDHWYON-UHFFFAOYSA-N
Data  1 IC50
  Tab Delimited (TSV)   2D SDfile   Computed 3D by Vconf -m prep SDfile
Find this compound or compounds like it in BindingDB:
Activity Spreadsheet -- Enzyme Inhibition Constant Data from BindingDB
Found 1 hit for monomerid = 45382
TargetCoagulation factor XII(Homo sapiens (Human))
Pcmd
Curated by PubChem BioAssay
LigandPNGBDBM45382(4-[(4-keto-6-methyl-1H-pyrimidin-2-yl)amino]benzoi...)
Affinity DataIC50: >5.00E+4nM. Assay description: Molecular Library Screening Center Network (MLSCN) Penn Center for Molecular Discovery (PCMD) Assay Provider: Scott L. Diamond, University of Pennsy...
In DepthDetails PCBioAssay