BDBM454985 US10730874, Compound I-9::US11352356, Compound I-9
SMILES Cc1cccc2nc(Cn3cc(cn3)C(=O)NCc3ncn4ccc(Cl)cc34)cn12
InChI Key InChIKey=OYBHCKSHQPCSPX-UHFFFAOYSA-N
Data  2 EC50
  Tab Delimited (TSV)   2D SDfile   Computed 3D by Vconf -m prep SDfile
Find this compound or compounds like it in BindingDB:
Activity Spreadsheet -- Enzyme Inhibition Constant Data from BindingDB
Found 2 hits for monomerid = 454985
TargetPlasma kallikrein(Homo sapiens (Human))
Takeda Pharmaceutical
US Patent
LigandPNGBDBM454985(US10730874, Compound I-9 | US11352356, Compound I-...)
Affinity DataEC50:  55nM. Assay description: Example compounds were evaluated for inhibition of the human activated kallikrein enzyme in two formats of an assay employing a fluorogenic peptide s...
Ligand InfoPC cidPC sid
In DepthDetails US Patent
TargetPlasma kallikrein(Homo sapiens (Human))
Takeda Pharmaceutical
US Patent
LigandPNGBDBM454985(US10730874, Compound I-9 | US11352356, Compound I-...)
Affinity DataEC50:  55nM. Assay description: Example compounds were evaluated for inhibition of the human activated kallikrein enzyme in two formats of an assay employing a fluorogenic peptide s...
Ligand InfoPC cidPC sid
In DepthDetails US Patent