BDBM45570 (4-oxidanylidenepyrido[1,2-a]pyrimidin-2-yl) benzoate::(4-oxopyrido[1,2-a]pyrimidin-2-yl) benzoate::4-oxo-4H-pyrido[1,2-a]pyrimidin-2-yl benzoate::MLS000701914::SMR000224668::benzoic acid (4-ketopyrido[1,2-a]pyrimidin-2-yl) ester::benzoic acid (4-oxo-2-pyrido[1,2-a]pyrimidinyl) ester::cid_824989
SMILES O=C(Oc1cc(=O)n2ccccc2n1)c1ccccc1
InChI Key InChIKey=PEBIBWVFVFOZCA-UHFFFAOYSA-N
Data  1 IC50
  Tab Delimited (TSV)   2D SDfile   Computed 3D by Vconf -m prep SDfile
Find this compound or compounds like it in BindingDB:
Activity Spreadsheet -- Enzyme Inhibition Constant Data from BindingDB
Found 1 hit for monomerid = 45570
TargetCoagulation factor XII(Homo sapiens (Human))
Pcmd
Curated by PubChem BioAssay
LigandPNGBDBM45570((4-oxidanylidenepyrido[1,2-a]pyrimidin-2-yl) benzo...)
Affinity DataIC50:  1.69E+3nM. Assay description: Molecular Library Screening Center Network (MLSCN) Penn Center for Molecular Discovery (PCMD) Assay Provider: Scott L. Diamond, University of Pennsy...
In DepthDetails PCBioAssay