BDBM45641 4-[[2-(2-furanylmethylamino)-1,2-dioxoethyl]amino]benzoic acid butyl ester::4-[[2-(2-furfurylamino)-2-keto-acetyl]amino]benzoic acid butyl ester::MLS000718182::SMR000279950::butyl 4-[[2-(furan-2-ylmethylamino)-2-oxidanylidene-ethanoyl]amino]benzoate::butyl 4-[[2-(furan-2-ylmethylamino)-2-oxoacetyl]amino]benzoate::cid_1903239
SMILES CCCCOC(=O)c1ccc(NC(=O)C(=O)NCc2ccco2)cc1
InChI Key InChIKey=CFKQZBSQNFEMQQ-UHFFFAOYSA-N
Data  1 IC50
  Tab Delimited (TSV)   2D SDfile   Computed 3D by Vconf -m prep SDfile
Find this compound or compounds like it in BindingDB:
Activity Spreadsheet -- Enzyme Inhibition Constant Data from BindingDB
Found 1 hit for monomerid = 45641
TargetCoagulation factor XII(Homo sapiens (Human))
Pcmd
Curated by PubChem BioAssay
LigandPNGBDBM45641(4-[[2-(2-furanylmethylamino)-1,2-dioxoethyl]amino]...)
Affinity DataIC50: >5.00E+4nM. Assay description: Molecular Library Screening Center Network (MLSCN) Penn Center for Molecular Discovery (PCMD) Assay Provider: Scott L. Diamond, University of Pennsy...
In DepthDetails PCBioAssay