BDBM45942 5-[4-(4-ethylphenyl)phenyl]-1-phenyl-1,2,4-triazol-3-amine::MLS-0146177.0001::[5-[4-(4-ethylphenyl)phenyl]-1-phenyl-1,2,4-triazol-3-yl]amine::cid_24178151
SMILES CCc1ccc(cc1)-c1ccc(cc1)-c1nc(N)nn1-c1ccccc1
InChI Key InChIKey=OIXGPROTUZKKIU-UHFFFAOYSA-N
Data  2 IC50
  Tab Delimited (TSV)   2D SDfile   Computed 3D by Vconf -m prep SDfile
Find this compound or compounds like it in BindingDB:
Activity Spreadsheet -- Enzyme Inhibition Constant Data from BindingDB
Found 2 hits for monomerid = 45942
TargetAlkaline phosphatase, germ cell type(Homo sapiens (Human))
Burnham Center For Chemical Genomics
Curated by PubChem BioAssay
LigandPNGBDBM45942(5-[4-(4-ethylphenyl)phenyl]-1-phenyl-1,2,4-triazol...)
Affinity DataIC50: >1.00E+5nM. Assay description: Data Source: Sanford-Burnham Center for Chemical Genomics (SBCCG) Source Affiliation: Sanford-Burnham Medical Research Institute (SBMRI, San Diego, C...
In DepthDetails PCBioAssay
TargetAlkaline phosphatase, tissue-nonspecific isozyme(Homo sapiens (Human))
Burnham Center For Chemical Genomics
Curated by PubChem BioAssay
LigandPNGBDBM45942(5-[4-(4-ethylphenyl)phenyl]-1-phenyl-1,2,4-triazol...)
Affinity DataIC50: >1.00E+5nM. Assay description: Sanford-Burnham Center for Chemical Genomics (SBCCG) Sanford-Burnham Medical Research Institute (SBMRI, San Diego, CA) NIH Molecular Libraries Screen...
In DepthDetails PCBioAssay