BDBM463574 US10781204, Compound I-9::US11434240, Compound I-9
SMILES Fc1cccc(F)c1-c1cc(c2C(=O)NCc2n1)-n1ccc(n1)N1CCC2(CCOCC2)CC1
InChI Key InChIKey=CTKQCFJHVOHZEK-UHFFFAOYSA-N
Data  4 KI
  Tab Delimited (TSV)   2D SDfile   Computed 3D by Vconf -m prep SDfile
Find this compound or compounds like it in BindingDB:
Activity Spreadsheet -- Enzyme Inhibition Constant Data from BindingDB
Found 4 hits for monomerid = 463574
TargetNon-receptor tyrosine-protein kinase TYK2(Homo sapiens (Human))
Nimbus Lakshmi
US Patent
LigandPNGBDBM463574(US10781204, Compound I-9 | US11434240, Compound I-...)
Affinity DataKi:  5nM. Assay description: Peptide substrate, [KKSRGDYMTMQIG], (20 μM) is prepared in reaction buffer (20 mM Hepes pH 7.5, 10 mM MgCl2, 1 mM EGTA, 0.02% Brij35, 0.02 mg/mL...
Ligand InfoPC cidPC sid
In DepthDetails US Patent
TargetNon-receptor tyrosine-protein kinase TYK2(Homo sapiens (Human))
Nimbus Lakshmi
US Patent
LigandPNGBDBM463574(US10781204, Compound I-9 | US11434240, Compound I-...)
Affinity DataKi:  5nM. Assay description: The caliper machine employs an off chip mobility shift assay to detect phosphorylated peptide substrates from kinase assays, using microfluidics tech...
Ligand InfoPC cidPC sid
In DepthDetails US Patent
TargetTyrosine-protein kinase JAK2(Homo sapiens (Human))
Nimbus Lakshmi
US Patent
LigandPNGBDBM463574(US10781204, Compound I-9 | US11434240, Compound I-...)
Affinity DataKi:  550nM. Assay description: Peptide substrate, [KKSRGDYMTMQIG], (20 μM) is prepared in reaction buffer (20 mM Hepes pH 7.5, 10 mM MgCl2, 1 mM EGTA, 0.02% Brij35, 0.02 mg/mL...
Ligand InfoPC cidPC sid
In DepthDetails US Patent
TargetTyrosine-protein kinase JAK2(Homo sapiens (Human))
Nimbus Lakshmi
US Patent
LigandPNGBDBM463574(US10781204, Compound I-9 | US11434240, Compound I-...)
Affinity DataKi:  550nM. Assay description: The caliper machine employs an off chip mobility shift assay to detect phosphorylated peptide substrates from kinase assays, using microfluidics tech...
Ligand InfoPC cidPC sid
In DepthDetails US Patent