BDBM46947 4-methyl-1-(4-methyl-2-nitro-phenyl)sulfonyl-piperidine::4-methyl-1-(4-methyl-2-nitrophenyl)sulfonylpiperidine::4-methyl-1-[(4-methyl-2-nitrophenyl)sulfonyl]piperidine::MLS000690489::SMR000300350::cid_2216028
SMILES CC1CCN(CC1)S(=O)(=O)c1ccc(C)cc1[N+]([O-])=O
InChI Key InChIKey=COHYHHYKQNHPKC-UHFFFAOYSA-N
Data  2 EC50
  Tab Delimited (TSV)   2D SDfile   Computed 3D by Vconf -m prep SDfile
Find this compound or compounds like it in BindingDB:
Activity Spreadsheet -- Enzyme Inhibition Constant Data from BindingDB
Found 2 hits for monomerid = 46947
TargetIon channel NompC(Danio rerio)
The Scripps Research Institute Molecular Screening Center
Curated by PubChem BioAssay
LigandPNGBDBM46947(4-methyl-1-(4-methyl-2-nitro-phenyl)sulfonyl-piper...)
Affinity DataEC50:  2.99E+4nM. Assay description: Source (MLPCN Center Name): The Scripps Research Institute Molecular Screening Center (SRIMSC) Center Affiliation: The Scripps Research Institute (TS...
In DepthDetails PCBioAssay
TargetMucolipin-3(Homo sapiens (Human))
The Scripps Research Institute Molecular Screening Center
Curated by PubChem BioAssay
LigandPNGBDBM46947(4-methyl-1-(4-methyl-2-nitro-phenyl)sulfonyl-piper...)
Affinity DataEC50:  3.83E+3nM. Assay description: Source (MLPCN Center Name): The Scripps Research Institute Molecular Screening Center (SRIMSC) Center Affiliation: The Scripps Research Institute (TS...
In DepthDetails PCBioAssay