BDBM4701 4-benzamidobenzoic acid::Benzoic Acid deriv. 14
SMILES OC(=O)c1ccc(NC(=O)c2ccccc2)cc1
InChI Key InChIKey=UZKKMWJMAJGMPF-UHFFFAOYSA-N
Data  1 IC50
  Tab Delimited (TSV)   2D SDfile   Computed 3D by Vconf -m prep SDfile
Find this compound or compounds like it in BindingDB:
Activity Spreadsheet -- Enzyme Inhibition Constant Data from BindingDB
Found 1 hit for monomerid = 4701
TargetNeuraminidase(Influenza A virus (N9))
Biocryst Pharmaceuticals
LigandPNGBDBM4701(4-benzamidobenzoic acid | Benzoic Acid deriv. 14)
Affinity DataIC50:  1.50E+6nMpH: 6.5 T: 2°C. Assay description: A standard fluorimetric assay was used to measure influenza virus neuraminidase activity. The substrate 2 -(4-methylumbelliferyl)-alpha-D-acetylneura...
In DepthDetails ArticlePubMed