BDBM4711 3-[(1E)-(hydroxyimino)methyl]-4-methanesulfonamidobenzoic acid::3-[(Hydroxyimino)methyl]-4-[(methylsulfonyl)amino]-benzoic Acid::Benzoic Acid deriv. 144::Benzoic Acid deriv. 7b
SMILES CS(=O)(=O)Nc1ccc(cc1CN=O)C(O)=O
InChI Key InChIKey=DUHXYQHLAYUDIL-UHFFFAOYSA-N
Data  2 IC50
  Tab Delimited (TSV)   2D SDfile   Computed 3D by Vconf -m prep SDfile
Find this compound or compounds like it in BindingDB:
Activity Spreadsheet -- Enzyme Inhibition Constant Data from BindingDB
Found 2 hits for monomerid = 4711
TargetNeuraminidase(Influenza A virus (N9))
Biocryst Pharmaceuticals
LigandPNGBDBM4711(3-[(1E)-(hydroxyimino)methyl]-4-methanesulfonamido...)
Affinity DataIC50:  2.00E+6nMpH: 6.5 T: 2°C. Assay description: A standard fluorimetric assay was used to measure influenza virus neuraminidase activity. The substrate 2 -(4-methylumbelliferyl)-alpha-D-acetylneura...
Ligand InfoPC cidPC sid
In DepthDetails ArticlePubMed
TargetNeuraminidase(Influenza A virus (N9))
Biocryst Pharmaceuticals
LigandPNGBDBM4711(3-[(1E)-(hydroxyimino)methyl]-4-methanesulfonamido...)
Affinity DataIC50:  2.00E+6nMpH: 6.5 T: 2°C. Assay description: A standard fluorimetric assay was used to measure influenza virus neuraminidase activity. The substrate 2 -(4-methylumbelliferyl)-alpha-D-acetylneura...
Ligand InfoPC cidPC sid
In DepthDetails ArticlePubMed