BDBM47849 2-chloranyl-N-[4,5-dimethyl-3-(phenylcarbonyl)thiophen-2-yl]ethanamide::MLS000555384::N-(3-Benzoyl-4,5-dimethyl-thiophen-2-yl)-2-chloro-acetamide::N-(3-benzoyl-4,5-dimethyl-2-thienyl)-2-chloro-acetamide::N-(3-benzoyl-4,5-dimethyl-2-thiophenyl)-2-chloroacetamide::N-(3-benzoyl-4,5-dimethylthiophen-2-yl)-2-chloroacetamide::SMR000177103::cid_615593
SMILES Cc1sc(NC(=O)CCl)c(C(=O)c2ccccc2)c1C
InChI Key InChIKey=IBUCDUYBJWBWGK-UHFFFAOYSA-N
Data  1 IC50
  Tab Delimited (TSV)   2D SDfile   Computed 3D by Vconf -m prep SDfile
Find this compound or compounds like it in BindingDB:
Activity Spreadsheet -- Enzyme Inhibition Constant Data from BindingDB
Found 1 hit for monomerid = 47849
Target3C-like protease(Avian infectious bronchitis virus)
The Scripps Research Institute Molecular Screening Center
Curated by PubChem BioAssay
LigandPNGBDBM47849(2-chloranyl-N-[4,5-dimethyl-3-(phenylcarbonyl)thio...)
Affinity DataIC50:  1.16E+4nM. Assay description: Source (MLPCN Center Name): The Scripps Research Institute Molecular Screening Center (SRIMSC) Center Affiliation: The Scripps Research Institute (TS...
In DepthDetails PCBioAssay