BDBM47951 2-[3-(4-formyl-2-methoxy-phenoxy)propoxy]benzoic acid methyl ester::2-[3-(4-formyl-2-methoxyphenoxy)propoxy]benzoic acid methyl ester::MLS000572946::SMR000195253::cid_2291980::methyl 2-[3-(4-formyl-2-methoxyphenoxy)propoxy]benzoate::methyl 2-[3-(4-methanoyl-2-methoxy-phenoxy)propoxy]benzoate
SMILES COC(=O)c1ccccc1OCCCOc1ccc(C=O)cc1OC
InChI Key InChIKey=PXWNXODGPYQZET-UHFFFAOYSA-N
Data  1 IC50
  Tab Delimited (TSV)   2D SDfile   Computed 3D by Vconf -m prep SDfile
Find this compound or compounds like it in BindingDB:
Activity Spreadsheet -- Enzyme Inhibition Constant Data from BindingDB
Found 1 hit for monomerid = 47951
TargetHeat shock protein HSP 90-alpha(Homo sapiens (Human))
The Scripps Research Institute Molecular Screening Center
Curated by PubChem BioAssay
LigandPNGBDBM47951(2-[3-(4-formyl-2-methoxy-phenoxy)propoxy]benzoic a...)
Affinity DataIC50:  314nM. Assay description: Source (MLPCN Center Name): The Scripps Research Institute Molecular Screening Center (SRIMSC) Center Affiliation: The Scripps Research Institute (TS...
In DepthDetails PCBioAssay