BDBM48010 5-[(4-ethylphenoxy)methyl]-2-furancarboxylic acid methyl ester::5-[(4-ethylphenoxy)methyl]furan-2-carboxylic acid methyl ester::MLS001198665::SMR000558803::cid_3842343::methyl 5-[(4-ethylphenoxy)methyl]-2-furoate::methyl 5-[(4-ethylphenoxy)methyl]furan-2-carboxylate
SMILES CCc1ccc(OCc2ccc(o2)C(=O)OC)cc1
InChI Key InChIKey=WAAUCSJLGYIACW-UHFFFAOYSA-N
Data  1 IC50
  Tab Delimited (TSV)   2D SDfile   Computed 3D by Vconf -m prep SDfile
Find this compound or compounds like it in BindingDB:
Activity Spreadsheet -- Enzyme Inhibition Constant Data from BindingDB
Found 1 hit for monomerid = 48010
TargetHeat shock protein HSP 90-alpha(Homo sapiens (Human))
The Scripps Research Institute Molecular Screening Center
Curated by PubChem BioAssay
LigandPNGBDBM48010(5-[(4-ethylphenoxy)methyl]-2-furancarboxylic acid ...)
Affinity DataIC50:  551nM. Assay description: Source (MLPCN Center Name): The Scripps Research Institute Molecular Screening Center (SRIMSC) Center Affiliation: The Scripps Research Institute (TS...
In DepthDetails PCBioAssay