BDBM48529 (Pyridin-2-ylsulfanyl)-acetic acid::2-(2-pyridinylthio)acetic acid::2-(2-pyridylthio)acetic acid::2-pyridin-2-ylsulfanylacetic acid::2-pyridin-2-ylsulfanylethanoic acid::MLS000032562::SMR000009363::cid_654661
SMILES OC(=O)CSc1ccccn1
InChI Key InChIKey=IGJFLPNTKLFHMW-UHFFFAOYSA-N
Data  1 IC50
  Tab Delimited (TSV)   2D SDfile   Computed 3D by Vconf -m prep SDfile
Find this compound or compounds like it in BindingDB:
Activity Spreadsheet -- Enzyme Inhibition Constant Data from BindingDB
Found 1 hit for monomerid = 48529
TargetEukaryotic translation initiation factor 4 gamma 1(Homo sapiens (Human))
Emory University
Curated by PubChem BioAssay
LigandPNGBDBM48529((Pyridin-2-ylsulfanyl)-acetic acid | 2-(2-pyridiny...)
Affinity DataIC50:  6.40E+4nM. Assay description: Dose Response Confirmation for Small Molecule Inhibitors of Eukaryotic Translation Initiation NIH Molecular Libraries Screening Centers Network [MLSC...
In DepthDetails PCBioAssay