BDBM487448 Methyl 4-(3-(4-chlorobenzyl)-2-methyl-7-oxo-4,7-dihydropyrazolo[1,5-a]pyrimidin-5-yl)benzoate::US10953012, Example 65
SMILES COC(=O)c1ccc(cc1)-c1cc(=O)n2nc(C)c(Cc3ccc(Cl)cc3)c2[nH]1
InChI Key InChIKey=LUAGMQSANAOCGC-UHFFFAOYSA-N
Data  1 IC50
  Tab Delimited (TSV)   2D SDfile   Computed 3D by Vconf -m prep SDfile
Find this compound or compounds like it in BindingDB:
Activity Spreadsheet -- Enzyme Inhibition Constant Data from BindingDB
Found 1 hit for monomerid = 487448
TargetCasein kinase II subunit alpha'(Homo sapiens (Human))
Bioenergenix
US Patent
LigandPNGBDBM487448(Methyl 4-(3-(4-chlorobenzyl)-2-methyl-7-oxo-4,7-di...)
Affinity DataIC50: >1.00E+4nM. Assay description: Purified CK2a2 (NP_001887; human full-length protein, GST tagged) from insect cells (final concentration 1.2 nM) is added to freshly prepared Base Re...
Ligand InfoPC cidPC sid
In DepthDetails US Patent