BDBM48797 3-[[(E)-2-phenylethenyl]sulfonylamino]benzoic acid [2-(carbamoylamino)-2-oxoethyl] ester::3-[[(E)-styryl]sulfonylamino]benzoic acid (2-keto-2-ureido-ethyl) ester::MLS000417833::SMR000243350::[2-(aminocarbonylamino)-2-oxidanylidene-ethyl] 3-[[(E)-2-phenylethenyl]sulfonylamino]benzoate::[2-(carbamoylamino)-2-oxoethyl] 3-[[(E)-2-phenylethenyl]sulfonylamino]benzoate::cid_2113711
SMILES NC(=O)NC(=O)COC(=O)c1cccc(NS(=O)(=O)\C=C\c2ccccc2)c1
InChI Key InChIKey=CPJMTUWDOHXMML-MDZDMXLPSA-N
Data  1 IC50  1 EC50
  Tab Delimited (TSV)   2D SDfile   Computed 3D by Vconf -m prep SDfile
Find this compound or compounds like it in BindingDB:
Activity Spreadsheet -- Enzyme Inhibition Constant Data from BindingDB
Found 2 hits for monomerid = 48797
TargetTropomyosin alpha-1 chain(Sus scrofa)
The Scripps Research Institute Molecular Screening Center
Curated by PubChem BioAssay
LigandPNGBDBM48797(3-[[(E)-2-phenylethenyl]sulfonylamino]benzoic acid...)
Affinity DataEC50: >7.15E+4nM. Assay description: Source (MLPCN Center Name): The Scripps Research Institute Molecular Screening Center (SRIMSC) Affiliation: The Scripps Research Institute, TSRI Assa...
In DepthDetails PCBioAssay
TargetEukaryotic translation initiation factor 4 gamma 1(Homo sapiens (Human))
Emory University
Curated by PubChem BioAssay
LigandPNGBDBM48797(3-[[(E)-2-phenylethenyl]sulfonylamino]benzoic acid...)
Affinity DataIC50:  5.00E+4nM. Assay description: Dose Response Confirmation for Small Molecule Inhibitors of Eukaryotic Translation Initiation NIH Molecular Libraries Screening Centers Network [MLSC...
In DepthDetails PCBioAssay