BDBM492482 US10975084, Example 11-45::ethyl {4-[6-(1- methylethyl)-7-oxo-4,7- dihydro[1,2,4]triazolo[1,5- a]pyrimidin-5-yl]phenyl}acetate
SMILES CCOC(=O)Cc1ccc(cc1)-c1[nH]c2ncnn2c(=O)c1C(C)C
InChI Key InChIKey=PAYWVXYRTAAGLZ-UHFFFAOYSA-N
Data  1 IC50
  Tab Delimited (TSV)   2D SDfile   Computed 3D by Vconf -m prep SDfile
Find this compound or compounds like it in BindingDB:
Activity Spreadsheet -- Enzyme Inhibition Constant Data from BindingDB
Found 1 hit for monomerid = 492482
TargetLysine-specific demethylase 5B(Homo sapiens (Human))
Merck Sharp & Dohme
US Patent
LigandPNGBDBM492482(US10975084, Example 11-45 | ethyl {4-[6-(1- methyl...)
Affinity DataIC50:  17.4nM. Assay description: In this assay, the potency (IC50) of each compound was determined from a ten point (1:3 serial dilution; final compound concentration range in assay ...
Ligand InfoPC cidPC sid
In DepthDetails US Patent