BDBM49424 MLS000540402::SMR000125660::cid_1476749::phenyl-[3-(2-phenyl-1,3-thiazol-5-yl)pyrazol-1-yl]methanone::phenyl-[3-(2-phenyl-5-thiazolyl)-1-pyrazolyl]methanone::phenyl-[3-(2-phenylthiazol-5-yl)pyrazol-1-yl]methanone::phenyl[3-(2-phenyl-1,3-thiazol-5-yl)-1H-pyrazol-1-yl]methanone
SMILES O=C(c1ccccc1)n1ccc(n1)-c1cnc(s1)-c1ccccc1
InChI Key InChIKey=GBQUOUSKDRVTGB-UHFFFAOYSA-N
Data  1 EC50
  Tab Delimited (TSV)   2D SDfile   Computed 3D by Vconf -m prep SDfile
Find this compound or compounds like it in BindingDB:
Activity Spreadsheet -- Enzyme Inhibition Constant Data from BindingDB
Found 1 hit for monomerid = 49424
TargetTranscription factor p65(Homo sapiens (Human))
Srmlsc
Curated by PubChem BioAssay
LigandPNGBDBM49424(MLS000540402 | SMR000125660 | cid_1476749 | phenyl...)
Affinity DataEC50:  1.49E+3nM. Assay description: Southern Research Molecular Libraries Screening Center (SRMLSC) Southern Research Institute (Birmingham, Alabama) NIH Molecular Libraries Screening C...
In DepthDetails PCBioAssay