BDBM49490 2,2,2-trifluoroethyl 3-(naphthalen-2-yloxymethyl)benzoate::2,2,2-trifluoroethyl 3-[(2-naphthyloxy)methyl]benzoate::2,2,2-tris(fluoranyl)ethyl 3-(naphthalen-2-yloxymethyl)benzoate::3-(2-naphthalenyloxymethyl)benzoic acid 2,2,2-trifluoroethyl ester::3-(2-naphthoxymethyl)benzoic acid 2,2,2-trifluoroethyl ester::MLS000325338::SMR000159446::cid_1011983
SMILES FC(F)(F)COC(=O)c1cccc(COc2ccc3ccccc3c2)c1
InChI Key InChIKey=CLUPORXXUBNDNO-UHFFFAOYSA-N
Data  4 IC50  1 EC50
  Tab Delimited (TSV)   2D SDfile   Computed 3D by Vconf -m prep SDfile
Find this compound or compounds like it in BindingDB:
Activity Spreadsheet -- Enzyme Inhibition Constant Data from BindingDB
Found 5 hits for monomerid = 49490
TargetTranscription factor p65(Homo sapiens (Human))
Srmlsc
Curated by PubChem BioAssay
LigandPNGBDBM49490(2,2,2-trifluoroethyl 3-(naphthalen-2-yloxymethyl)b...)
Affinity DataEC50:  8.33E+5nM. Assay description: Southern Research Molecular Libraries Screening Center (SRMLSC) Southern Research Institute (Birmingham, Alabama) NIH Molecular Libraries Screening C...
In DepthDetails PCBioAssay
TargetDNA damage-inducible transcript 3 protein(Mus musculus)
Emory University
Curated by PubChem BioAssay
LigandPNGBDBM49490(2,2,2-trifluoroethyl 3-(naphthalen-2-yloxymethyl)b...)
Affinity DataIC50:  2.59E+3nM. Assay description: NIH Molecular Libraries Screening Centers Network [MLSCN] Emory Chemical Biology Discovery Center in MLSCN Assay provider: Dr. Randal Kaufman, Univer...
In DepthDetails PCBioAssay
TargetEndothelial PAS domain-containing protein 1(Homo sapiens (Human))
Burnham Center For Chemical Genomics
Curated by PubChem BioAssay
LigandPNGBDBM49490(2,2,2-trifluoroethyl 3-(naphthalen-2-yloxymethyl)b...)
Affinity DataIC50:  2.86E+3nM
In DepthDetails PCBioAssay
TargetDNA damage-inducible transcript 3 protein(Mus musculus)
Emory University
Curated by PubChem BioAssay
LigandPNGBDBM49490(2,2,2-trifluoroethyl 3-(naphthalen-2-yloxymethyl)b...)
Affinity DataIC50:  2.59E+3nM. Assay description: NIH Molecular Libraries Screening Centers Network [MLSCN] Emory Chemical Biology Discovery Center in MLSCN Assay provider: Dr. Randal Kaufman, Univer...
In DepthDetails PCBioAssay
TargetX-box-binding protein 1(Homo sapiens (Human))
Emory University
Curated by PubChem BioAssay
LigandPNGBDBM49490(2,2,2-trifluoroethyl 3-(naphthalen-2-yloxymethyl)b...)
Affinity DataIC50:  1.33E+3nM. Assay description: NIH Molecular Libraries Screening Centers Network [MLSCN] Emory Chemical Biology Discovery Center in MLSCN Assay provider: Dr. Randal Kaufman, Univer...
In DepthDetails PCBioAssay