BDBM49661 4-(1H-benzimidazol-2-yl)benzoic acid methyl ester::MLS000375407::SMR000254661::cid_2328806::methyl 4-(1H-benzimidazol-2-yl)benzoate
SMILES COC(=O)c1ccc(cc1)-c1nc2ccccc2[nH]1
InChI Key InChIKey=XVXVUZIONWAVTF-UHFFFAOYSA-N
Data  1 EC50
  Tab Delimited (TSV)   2D SDfile   Computed 3D by Vconf -m prep SDfile
Find this compound or compounds like it in BindingDB:
Activity Spreadsheet -- Enzyme Inhibition Constant Data from BindingDB
Found 1 hit for monomerid = 49661
TargetTranscription factor p65(Homo sapiens (Human))
Srmlsc
Curated by PubChem BioAssay
LigandPNGBDBM49661(4-(1H-benzimidazol-2-yl)benzoic acid methyl ester ...)
Affinity DataEC50:  946nM. Assay description: Southern Research Molecular Libraries Screening Center (SRMLSC) Southern Research Institute (Birmingham, Alabama) NIH Molecular Libraries Screening C...
In DepthDetails PCBioAssay