BDBM496845 SARS-CoV-2 PLpro Inhibitor, 75
SMILES C[C@@H](NC(=O)c1cc(NC2CNC2)ccc1C)c1cccc(c1)-c1ccc(s1)C(O)=O
InChI Key InChIKey=IQVFCZXMGASAGI-OAHLLOKOSA-N
Data  2 IC50  1 Kd
  Tab Delimited (TSV)   2D SDfile   Computed 3D by Vconf -m prep SDfile
Find this compound or compounds like it in BindingDB:
Activity Spreadsheet -- Enzyme Inhibition Constant Data from BindingDB
Found 3 hits for monomerid = 496845
TargetReplicase polyprotein 1ab(2019-nCoV)
University of Illinois At Chicago
LigandPNGBDBM496845(SARS-CoV-2 PLpro Inhibitor, 75)
Affinity DataIC50:  970nM. Assay description: The PLpro primary assay, which measures protease activity with the short peptide substrate Z-RLRGG-AMC (Bachem), was performed in black flat-bottom 3...
Ligand InfoPC cidPC sid
In DepthDetails ArticlePubMed
TargetReplicase polyprotein 1ab(2019-nCoV)
University of Illinois At Chicago
LigandPNGBDBM496845(SARS-CoV-2 PLpro Inhibitor, 75)
Affinity DataIC50:  970nM. Assay description: Inhibition of SARS-CoV-2 PLpro
Ligand InfoPC cidPC sid
In DepthDetails PubMed
TargetReplicase polyprotein 1ab(2019-nCoV)
University of Illinois At Chicago
LigandPNGBDBM496845(SARS-CoV-2 PLpro Inhibitor, 75)
Affinity DataKd:  2.06E+3nM. Assay description: The His-tagged SARS-CoV-2 PLpro enzyme was initially prepared in phosphate buffer and diluted to 50 ug/mL with 10 mM sodium acetate (pH 5.5) and immo...
Ligand InfoPC cidPC sid
In DepthDetails ArticlePubMed