BDBM496946 cmdc.202100576, 19d
SMILES CC(C)C(=O)Nc1ccc(cc1)N([C@H](C(=O)NCc1ccccc1)c1cccc(F)c1)C(=O)Cn1nnc2ccccc12
InChI Key InChIKey=PGBBZORGQALHAL-HKBQPEDESA-N
Data  1 IC50
  Tab Delimited (TSV)   2D SDfile   Computed 3D by Vconf -m prep SDfile
Find this compound or compounds like it in BindingDB:
Activity Spreadsheet -- Enzyme Inhibition Constant Data from BindingDB
Found 1 hit for monomerid = 496946
TargetReplicase polyprotein 1ab(Human SARS coronavirus (SARS-CoV) (Severe acute re...)
Experimental Drug Development Centre
LigandPNGBDBM496946(cmdc.202100576, 19d)
Affinity DataIC50:  1.60E+3nM. Assay description: Please point to the patents.
Ligand InfoPC cidPC sid
In DepthDetails ArticlePubMed