BDBM497131 US11001561, Compound 106
SMILES Cc1nc(N2CCC3(Cc4ccccc4[C@H]3N)CC2)c(C)c(=O)n1-c1cccc(Cl)c1Cl
InChI Key InChIKey=MFHWVKLJXFEKJX-JOCHJYFZSA-N
Data  3 IC50
  Tab Delimited (TSV)   2D SDfile   Computed 3D by Vconf -m prep SDfile
Find this compound or compounds like it in BindingDB:
Activity Spreadsheet -- Enzyme Inhibition Constant Data from BindingDB
Found 3 hits for monomerid = 497131
TargetTyrosine-protein phosphatase non-receptor type 11(Homo sapiens (Human))
Merck Patent
US Patent
LigandPNGBDBM497131(US11001561, Compound 106)
Affinity DataIC50:  6nM. Assay description: The inhibition of SHP2 by compounds of the invention was monitored using the surrogate substrate DiFMUP after protein activation by a peptide bearing...
Ligand InfoPC cidPC sid
In DepthDetails US Patent
TargetTyrosine-protein phosphatase non-receptor type 11(Homo sapiens (Human))
Merck Patent
US Patent
LigandPNGBDBM497131(US11001561, Compound 106)
Affinity DataIC50:  1nM. Assay description: Antagonist activity at recombinant human N-terminal His6-tagged full length SHP2 expressed in Escherichia coli using DiFMUP as substrate measured aft...
Ligand InfoPC cidPC sid
In DepthDetails ArticlePubMed
TargetTyrosine-protein phosphatase non-receptor type 11(Homo sapiens (Human))
Merck Patent
US Patent
LigandPNGBDBM497131(US11001561, Compound 106)
Affinity DataIC50:  2nM. Assay description: Antagonist activity at SHP2 in human KYSE520 cells assessed as inhibition of ERK1/2 phosphorylation incubated for 2 hrs
Ligand InfoPC cidPC sid
In DepthDetails ArticlePubMed