BDBM497579 (2R)-2-[2-[6-[(1S,8R)-5-(2,6- difluorophenyl)-11,11-dimethyl-3,4- diazatricyclo[6.2.1.02,7]undeca-2(7),3,5- trien-1-yl]pyrazin-2-yl]oxazol-4- yl]propanenitrile::US11008312, Example 74
SMILES C[C@H](C#N)c1coc(n1)-c1cncc(n1)[C@@]12CC[C@@H](c3cc(nnc13)-c1c(F)cccc1F)C2(C)C
InChI Key InChIKey=GDXKFBJVQNCKHB-WBQUBVHPSA-N
Data  1 IC50
  Tab Delimited (TSV)   2D SDfile   Computed 3D by Vconf -m prep SDfile
Find this compound or compounds like it in BindingDB:
Activity Spreadsheet -- Enzyme Inhibition Constant Data from BindingDB
Found 1 hit for monomerid = 497579
TargetNuclear receptor ROR-gamma(Homo sapiens (Human))
Genentech
US Patent
LigandPNGBDBM497579((2R)-2-[2-[6-[(1S,8R)-5-(2,6- difluorophenyl)-11,1...)
Affinity DataIC50:  5.60nM. Assay description: 50 mM HEPES buffer (pH 7.4); 150 mM NaCl; 1 mM DTT; 5 mM MgCl2; 0.01% BSA; 5% DMSO; 0.6 ug/mL RORc receptor; 6 nM 25-[3H]hydroxycholesterol. For NSB ...
Ligand InfoPC cidPC sid
In DepthDetails US Patent