BDBM498135 US11013745, Compound E-Y51
SMILES CC(C)(C)OC(=O)N1CCC(=CC1)c1cc(C#N)c(NCc2ccco2)n2cnnc12
InChI Key InChIKey=FLKYDMHLGCEZDO-UHFFFAOYSA-N
Data  1 IC50
  Tab Delimited (TSV)   2D SDfile   Computed 3D by Vconf -m prep SDfile
Find this compound or compounds like it in BindingDB:
Activity Spreadsheet -- Enzyme Inhibition Constant Data from BindingDB
Found 1 hit for monomerid = 498135
TargetHistone-binding protein RBBP4/Histone-lysine N-methyltransferase EZH2/Polycomb protein EED [40-441]/Polycomb protein SUZ12(Homo sapiens (Human))
Shanghai Institute of Material Medica, Chinese Academy of Sciences
US Patent
LigandPNGBDBM498135(US11013745, Compound E-Y51)
Affinity DataIC50:  200nM. Assay description: The TR-FRET method was used to measure the PRC2 enzyme activity. First, the enzyme was mixed with compounds at different concentrations and incubated...
Ligand InfoPC cidPC sid
In DepthDetails US Patent