BDBM498297 US11014911, Example 122::US11014911, Example 123::US11718603, Example 123
SMILES COc1ccc(CC(=O)Nc2cc([nH]n2)[C@H]2CC[C@H](C2)OC(=O)NC2(C)CCOC2)cn1
InChI Key
Data  8 KI
  Tab Delimited (TSV)   2D SDfile   Computed 3D by Vconf -m prep SDfile
Find this compound or compounds like it in BindingDB:
Activity Spreadsheet -- Enzyme Inhibition Constant Data from BindingDB
Found 8 hits for monomerid = 498297
TargetCyclin-dependent kinase 2/G1/S-specific cyclin-E1(Homo sapiens (Human))
Pfizer
US Patent
LigandPNGBDBM498297(US11014911, Example 122 | US11014911, Example 123 ...)
Affinity DataKi:  0.130nM. Assay description: The purpose of CDK2/Cyclin E1 assay is to evaluate the inhibition (% inhibition, Kiapp and Ki values) of small molecule inhibitors by using a fluores...
Ligand InfoPC cidPC sid
In DepthDetails US Patent
TargetCyclin-dependent kinase 2/G1/S-specific cyclin-E1(Homo sapiens (Human))
Pfizer
US Patent
LigandPNGBDBM498297(US11014911, Example 122 | US11014911, Example 123 ...)
Affinity DataKi:  0.130nM. Assay description: The purpose of CDK2/Cyclin E1 assay is to evaluate the inhibition (% inhibition, Kiapp and Ki values) of small molecule inhibitors by using a fluores...
Ligand InfoPC cidPC sid
In DepthDetails US Patent
TargetCyclin-dependent kinase 2/G1/S-specific cyclin-E1(Homo sapiens (Human))
Pfizer
US Patent
LigandPNGBDBM498297(US11014911, Example 122 | US11014911, Example 123 ...)
Affinity DataKi:  0.220nM. Assay description: The purpose of CDK2/Cyclin E1 assay is to evaluate the inhibition (% inhibition, Kiapp and Ki values) of small molecule inhibitors by using a fluores...
Ligand InfoPC cidPC sid
In DepthDetails US Patent
TargetCyclin-dependent kinase 2/G1/S-specific cyclin-E1(Homo sapiens (Human))
Pfizer
US Patent
LigandPNGBDBM498297(US11014911, Example 122 | US11014911, Example 123 ...)
Affinity DataKi:  0.220nM. Assay description: The purpose of CDK2/Cyclin E1 assay is to evaluate the inhibition (% inhibition, Kiapp and Ki values) of small molecule inhibitors by using a fluores...
Ligand InfoPC cidPC sid
In DepthDetails US Patent
TargetGlycogen synthase kinase-3 beta(Homo sapiens (Human))
Pfizer
US Patent
LigandPNGBDBM498297(US11014911, Example 122 | US11014911, Example 123 ...)
Affinity DataKi:  8.87nM. Assay description: The purpose of GSK3β assay is to evaluate the inhibition (% inhibition, Kiapp and Ki values) of small molecule inhibitors by using a fluorescenc...
Ligand InfoPC cidPC sid
In DepthDetails US Patent
TargetGlycogen synthase kinase-3 beta(Homo sapiens (Human))
Pfizer
US Patent
LigandPNGBDBM498297(US11014911, Example 122 | US11014911, Example 123 ...)
Affinity DataKi:  8.87nM. Assay description: The purpose of GSK3β assay is to evaluate the inhibition (% inhibition, Kiapp and Ki values) of small molecule inhibitors by using a fluorescenc...
Ligand InfoPC cidPC sid
In DepthDetails US Patent
TargetGlycogen synthase kinase-3 beta(Homo sapiens (Human))
Pfizer
US Patent
LigandPNGBDBM498297(US11014911, Example 122 | US11014911, Example 123 ...)
Affinity DataKi:  12.7nM. Assay description: The purpose of GSK3β assay is to evaluate the inhibition (% inhibition, Kiapp and Ki values) of small molecule inhibitors by using a fluorescenc...
Ligand InfoPC cidPC sid
In DepthDetails US Patent
TargetGlycogen synthase kinase-3 beta(Homo sapiens (Human))
Pfizer
US Patent
LigandPNGBDBM498297(US11014911, Example 122 | US11014911, Example 123 ...)
Affinity DataKi:  12.7nM. Assay description: The purpose of GSK3β assay is to evaluate the inhibition (% inhibition, Kiapp and Ki values) of small molecule inhibitors by using a fluorescenc...
Ligand InfoPC cidPC sid
In DepthDetails US Patent