BDBM498413 (1R,3S)-3-(3-{[(4- fluorophenyl)acetyl]amino}- 1H-pyrazol-5-yl)cyclopentyl ethyl(methyl)carbamate::US11014911, Example 238::US11718603, Example 238
SMILES CCN(C)C(=O)O[C@@H]1CC[C@@H](C1)c1cc(NC(=O)Cc2ccc(F)cc2)n[nH]1
InChI Key
Data  4 KI
  Tab Delimited (TSV)   2D SDfile   Computed 3D by Vconf -m prep SDfile
Find this compound or compounds like it in BindingDB:
Activity Spreadsheet -- Enzyme Inhibition Constant Data from BindingDB
Found 4 hits for monomerid = 498413
TargetCyclin-dependent kinase 2/G1/S-specific cyclin-E1(Homo sapiens (Human))
Pfizer
US Patent
LigandPNGBDBM498413((1R,3S)-3-(3-{[(4- fluorophenyl)acetyl]amino}- 1H...)
Affinity DataKi:  1.13nM. Assay description: The purpose of CDK2/Cyclin E1 assay is to evaluate the inhibition (% inhibition, Kiapp and Ki values) of small molecule inhibitors by using a fluores...
Ligand InfoPC cidPC sid
In DepthDetails US Patent
TargetCyclin-dependent kinase 2/G1/S-specific cyclin-E1(Homo sapiens (Human))
Pfizer
US Patent
LigandPNGBDBM498413((1R,3S)-3-(3-{[(4- fluorophenyl)acetyl]amino}- 1H...)
Affinity DataKi:  1.13nM. Assay description: The purpose of CDK2/Cyclin E1 assay is to evaluate the inhibition (% inhibition, Kiapp and Ki values) of small molecule inhibitors by using a fluores...
Ligand InfoPC cidPC sid
In DepthDetails US Patent
TargetGlycogen synthase kinase-3 beta(Homo sapiens (Human))
Pfizer
US Patent
LigandPNGBDBM498413((1R,3S)-3-(3-{[(4- fluorophenyl)acetyl]amino}- 1H...)
Affinity DataKi:  14.7nM. Assay description: The purpose of GSK3β assay is to evaluate the inhibition (% inhibition, Kiapp and Ki values) of small molecule inhibitors by using a fluorescenc...
Ligand InfoPC cidPC sid
In DepthDetails US Patent
TargetGlycogen synthase kinase-3 beta(Homo sapiens (Human))
Pfizer
US Patent
LigandPNGBDBM498413((1R,3S)-3-(3-{[(4- fluorophenyl)acetyl]amino}- 1H...)
Affinity DataKi:  14.7nM. Assay description: The purpose of GSK3β assay is to evaluate the inhibition (% inhibition, Kiapp and Ki values) of small molecule inhibitors by using a fluorescenc...
Ligand InfoPC cidPC sid
In DepthDetails US Patent